{"text_format":"1","workbook":"xlsx","n_sheets":7,"sheets":["使い方","フラッシュカードデータ","問題","フラッシュカード(画面表示）","フラッシュカード(画面表示）《指定順表示》","フラッシュカード(横長印刷用）","フラッシュカード(横短印刷用）"],"not_rendered":{"charts":0,"images":0,"macros":1,"external_links":0,"defined_names":4,"comments":0,"pivot_tables":0},"unopened":[],"bounds":{"document_bytes":16777216,"sheet_cells":100000,"rows_first":2000,"rows_last":500,"rows_between":2000,"halvings":0,"cell_chars":16384,"cell_head_chars":4096},"cells_cut":0,"cells_raw":0,"read":"whole","date_system":"1900"}

{"sheet":"使い方","index":0,"n_rows":38,"n_cols":3,"rows_kept":38,"cut":false,"hidden":false,"merged":[]}
["Microsoft Excel で フラッシュカードを作ろう（テキスト用）"]
[]
["このファイルは，両面にテキストデータを扱うためのものです。"]
["「Microsoft Excel で フラッシュカードを作ろう」のすべてのもとになったものです。"]
["使用する機器に合わせた，セルの高さ調整などはこのファイルであらかじめ数値を確認しておくと便利です。"]
[]
["このワークシートを使うことで、ディスプレイやプロジェクターをフラッシュカードのように使ったり、"]
["通常のフラッシュカードを作成したりすることが手軽にできます。"]
["使い方は、下記の通りです。"]
[]
[1,"「フラッシュカードデータ」の表に、データを入力します。"]
[null,null,"タイトルをセルC2に入力する。"]
[null,null,"データの入力範囲は、\"D4:E103\"です。"]
[]
[2,"「フラッシュカード(画面表示）」「フラッシュカード(画面表示）《指定順表示》」で、"]
[null,"フラッシュカードをディスプレイやプロジェクターで表示します。"]
[null,null,"画面のサイズに合わせて、タイトル行やカード行の高さを変えたり、"]
[null,null,"Excelの表示倍率を変えたりして、フラッシュカードがちょうどよく"]
[null,null,"表示されるようにします。"]
[null,null,"カーソルキー（↑↓）を使って、フラッシュカードの表、裏を切り替えます。"]
{"$rows_left_out":19}
{"sheet":"フラッシュカードデータ","index":1,"n_rows":103,"n_cols":7,"rows_kept":103,"cut":false,"hidden":false,"merged":[[1,2,1,4],[0,6,1,8]]}
[null,null,"フラッシュカードデータ",null,null,null,"フラッシュカード\n（画面表示）"]
[null,null,"たすのかな　ひくのかな"]
[null,null,"№","表","裏"]
[{"$f":"IF(D4=\"\",\"\",RAND())","v":0.81414844495399052},{"$f":"IF(A4=\"\",\"\",RANK(A4,$A$4:$A$103))","v":2},1,{"$f":"問題!O1","v":"　あおいさんたちは　8にんで　あそんで　いました。そこへ　ともだちが　8にん　きました。みんなで　なんにんに　なりましたか。"},{"$f":"問題!P1","v":"8＋8"}]
[{"$f":"IF(D5=\"\",\"\",RAND())","v":1.0272838519531313E-2},{"$f":"IF(A5=\"\",\"\",RANK(A5,$A$4:$A$103))","v":6},2,{"$f":"問題!O2","v":"　あおいさんたちは　14にんで　あそんで　いました。その　うち　7にんが　かえりました。のこっているこは　なんにんに　なりましたか。"},{"$f":"問題!P2","v":"14－7"}]
[0.28120800332641349,5,3,{"$f":"問題!O3","v":"　とりが　6わ　きに　とまっていました。そこへ　7わ　とんできました。ぜんぶで　なんわに　なりましたか。"},{"$f":"問題!P3","v":"6＋7"}]
[0.78070934588249785,3,4,{"$f":"問題!O4","v":"　とりが　10わ　きに　とまっていました。その　うち　7わ　とんでいきました。のこりは　なんわに　なりましたか。"},{"$f":"問題!P4","v":"10－7"}]
[0.71200277765387043,4,5,{"$f":"問題!O5","v":"　あおい　じてんしゃが　7だい，あかい　じてんしゃが　5だい　あります。あわせて　なんだいですか。"},{"$f":"問題!P5","v":"7＋5"}]
[0.97837294377913508,1,6,{"$f":"問題!O6","v":"　あおい　じてんしゃが　8だい，あかい　じてんしゃが　6だい　あります。どちらが　なんだい　おおいですか。"},{"$f":"問題!P6","v":"8－6"}]
["","",7]
["","",8]
["","",9]
["","",10]
["","",11]
["","",12,null,null,null,"←左の表に"]
["","",13,null,null,null,"フラッシュカードの表・裏に"]
["","",14,null,null,null,"表示するデータを入力します。"]
["","",15]
["","",16]
["","",17]
{"$rows_left_out":84}
{"sheet":"問題","index":2,"n_rows":6,"n_cols":16,"rows_kept":6,"cut":false,"hidden":false,"merged":[]}
[null,"　あおいさんたちは　",{"$f":"INT(RAND()*5+5)","v":8},"にんで　あそんで　いました。そこへ　ともだちが　",null,null,null,{"$f":"INT(RAND()*5+5)","v":8},"にん　きました。みんなで　なんにんに　なりましたか。",null,null,null,null,null,{"$f":"B1&C1&D1&H1&I1","v":"　あおいさんたちは　8にんで　あそんで　いました。そこへ　ともだちが　8にん　きました。みんなで　なんにんに　なりましたか。"},{"$f":"C1&\"＋\"&H1","v":"8＋8"}]
[null,"　あおいさんたちは　",{"$f":"INT(RAND()*6+10)","v":14},"にんで　あそんで　いました。その　うち　",null,null,null,7,"にんが　かえりました。のこっているこは　なんにんに　なりましたか。",null,null,null,null,null,{"$f":"B2&C2&D2&H2&I2","v":"　あおいさんたちは　14にんで　あそんで　いました。その　うち　7にんが　かえりました。のこっているこは　なんにんに　なりましたか。"},{"$f":"C2&\"－\"&H2","v":"14－7"}]
[null,"　とりが　",{"$f":"INT(RAND()*5+5)","v":6},"わ　きに　とまっていました。そこへ　",null,null,null,7,"わ　とんできました。ぜんぶで　なんわに　なりましたか。",null,null,null,null,null,{"$f":"B3&C3&D3&H3&I3","v":"　とりが　6わ　きに　とまっていました。そこへ　7わ　とんできました。ぜんぶで　なんわに　なりましたか。"},{"$f":"C3&\"＋\"&H3","v":"6＋7"}]
[null,"　とりが　",{"$f":"INT(RAND()*6+10)","v":10},"わ　きに　とまっていました。その　うち　",null,null,null,7,"わ　とんでいきました。のこりは　なんわに　なりましたか。",null,null,null,null,null,{"$f":"B4&C4&D4&H4&I4","v":"　とりが　10わ　きに　とまっていました。その　うち　7わ　とんでいきました。のこりは　なんわに　なりましたか。"},{"$f":"C4&\"－\"&H4","v":"10－7"}]
[null,"　あおい　じてんしゃが　",null,{"$f":"INT(RAND()*5+5)","v":7},"だい，あかい　じてんしゃが　",null,null,5,"だい　あります。あわせて　なんだいですか。",null,null,null,null,null,{"$f":"B5&D5&E5&H5&I5","v":"　あおい　じてんしゃが　7だい，あかい　じてんしゃが　5だい　あります。あわせて　なんだいですか。"},{"$f":"D5&\"＋\"&H5","v":"7＋5"}]
[null,"　あおい　じてんしゃが　",null,{"$f":"INT(RAND()*5+5)","v":8},"だい，あかい　じてんしゃが　",null,null,6,"だい　あります。どちらが　なんだい　おおいですか。",null,null,null,null,null,{"$f":"B6&D6&E6&H6&I6","v":"　あおい　じてんしゃが　8だい，あかい　じてんしゃが　6だい　あります。どちらが　なんだい　おおいですか。"},{"$f":"D6&\"－\"&H6","v":"8－6"}]

{"sheet":"フラッシュカード(画面表示）","index":3,"n_rows":201,"n_cols":17,"rows_kept":201,"cut":false,"hidden":false,"merged":[[1,0,2,0],[3,0,4,0],[5,0,6,0],[7,0,8,0],[9,0,10,0],[11,0,12,0],[0,16,0,17],[0,10,0,11],[25,0,26,0],[1,3,1,21],[2,3,2,21],[147,3,147,26],[13,0,14,0],[15,0,16,0],[17,0,18,0],[19,0,20,0],[21,0,22,0],[23,0,24,0],[37,0,38,0],[39,0,40,0],[71,0,72,0],[33,0,34,0],[27,0,28,0],[29,0,30,0],[31,0,32,0],[35,0,36,0],[61,0,62,0],[63,0,64,0],[65,0,66,0],[67,0,68,0],[69,0,70,0],[43,0,44,0],[45,0,46,0],[47,0,48,0],[41,0,42,0],[49,0,50,0],[51,0,52,0],[53,0,54,0],[55,0,56,0],[57,0,58,0],[59,0,60,0],[85,0,86,0],[87,0,88,0],[89,0,90,0],[91,0,92,0],[93,0,94,0],[95,0,96,0],[73,0,74,0],[75,0,76,0],[77,0,78,0],[79,0,80,0],[81,0,82,0],[83,0,84,0],[109,0,110,0],[111,0,112,0],[113,0,114,0],[115,0,116,0],[117,0,118,0],[119,0,120,0],[97,0,98,0],[99,0,100,0],[101,0,102,0],[103,0,104,0],[105,0,106,0],[107,0,108,0],[133,0,134,0],[135,0,136,0],[137,0,138,0],[139,0,140,0],[141,0,142,0],[143,0,144,0],[121,0,122,0],[123,0,124,0],[125,0,126,0],[127,0,128,0],[129,0,130,0],[131,0,132,0],[157,0,158,0],[159,0,160,0],[161,0,162,0],[163,0,164,0],[165,0,166,0],[167,0,168,0],[145,0,146,0],[147,0,148,0],[149,0,150,0],[151,0,152,0],[153,0,154,0],[155,0,156,0],[181,0,182,0],[183,0,184,0],[185,0,186,0],[187,0,188,0],[189,0,190,0],[191,0,192,0],[169,0,170,0],[171,0,172,0],[173,0,174,0],[175,0,176,0],[177,0,178,0],[179,0,180,0],[205,0,206,0],[207,0,208,0],[209,0,210,0],[193,0,194,0],[195,0,196,0],[197,0,198,0],[199,0,200,0],[201,0,202,0],[203,0,204,0]]}
[null,{"$f":"IF(フラッシュカードデータ!$C$2=\"\",\"\",フラッシュカードデータ!$C$2)","v":"たすのかな　ひくのかな"},null,null,null,null,null,null,null,null,100,null,null,null,null,null,409]
[1,{"$f":"IFERROR(VLOOKUP($A2,フラッシュカードデータ!$B$4:$E$103,3,FALSE),\"\")","v":"　あおい　じてんしゃが　8だい，あかい　じてんしゃが　6だい　あります。どちらが　なんだい　おおいですか。"},null,"表示機器にあわせて\n行の高さや\n表示倍率を調節してください。"]
[null,{"$f":"IFERROR(VLOOKUP($A2,フラッシュカードデータ!$B$4:$E$103,4,FALSE),\"\")","v":"8－6"},null,"カーソルキー（↑↓）を使って、\nフラッシュカードを切り替えて\n使用してください。"]
[2,{"$f":"IFERROR(VLOOKUP($A4,フラッシュカードデータ!$B$4:$E$103,3,FALSE),\"\")","v":"　あおいさんたちは　8にんで　あそんで　いました。そこへ　ともだちが　8にん　きました。みんなで　なんにんに　なりましたか。"}]
[null,{"$f":"IFERROR(VLOOKUP($A4,フラッシュカードデータ!$B$4:$E$103,4,FALSE),\"\")","v":"8＋8"}]
[3,{"$f":"IFERROR(VLOOKUP($A6,フラッシュカードデータ!$B$4:$E$103,3,FALSE),\"\")","v":"　とりが　10わ　きに　とまっていました。その　うち　7わ　とんでいきました。のこりは　なんわに　なりましたか。"}]
[null,{"$f":"IFERROR(VLOOKUP($A6,フラッシュカードデータ!$B$4:$E$103,4,FALSE),\"\")","v":"10－7"}]
[4,{"$f":"IFERROR(VLOOKUP($A8,フラッシュカードデータ!$B$4:$E$103,3,FALSE),\"\")","v":"　あおい　じてんしゃが　7だい，あかい　じてんしゃが　5だい　あります。あわせて　なんだいですか。"}]
[null,{"$f":"IFERROR(VLOOKUP($A8,フラッシュカードデータ!$B$4:$E$103,4,FALSE),\"\")","v":"7＋5"}]
[5,{"$f":"IFERROR(VLOOKUP($A10,フラッシュカードデータ!$B$4:$E$103,3,FALSE),\"\")","v":"　とりが　6わ　きに　とまっていました。そこへ　7わ　とんできました。ぜんぶで　なんわに　なりましたか。"}]
[null,{"$f":"IFERROR(VLOOKUP($A10,フラッシュカードデータ!$B$4:$E$103,4,FALSE),\"\")","v":"6＋7"}]
[6,{"$f":"IFERROR(VLOOKUP($A12,フラッシュカードデータ!$B$4:$E$103,3,FALSE),\"\")","v":"　あおいさんたちは　14にんで　あそんで　いました。その　うち　7にんが　かえりました。のこっているこは　なんにんに　なりましたか。"}]
[null,{"$f":"IFERROR(VLOOKUP($A12,フラッシュカードデータ!$B$4:$E$103,4,FALSE),\"\")","v":"14－7"}]
[7,{"$f":"IFERROR(VLOOKUP($A14,フラッシュカードデータ!$B$4:$E$103,3,FALSE),\"\")","v":""}]
[null,{"$f":"IFERROR(VLOOKUP($A14,フラッシュカードデータ!$B$4:$E$103,4,FALSE),\"\")","v":""}]
[8,{"$f":"IFERROR(VLOOKUP($A16,フラッシュカードデータ!$B$4:$E$103,3,FALSE),\"\")","v":""}]
[null,{"$f":"IFERROR(VLOOKUP($A16,フラッシュカードデータ!$B$4:$E$103,4,FALSE),\"\")","v":""}]
[9,{"$f":"IFERROR(VLOOKUP($A18,フラッシュカードデータ!$B$4:$E$103,3,FALSE),\"\")","v":""}]
[null,{"$f":"IFERROR(VLOOKUP($A18,フラッシュカードデータ!$B$4:$E$103,4,FALSE),\"\")","v":""}]
[10,{"$f":"IFERROR(VLOOKUP($A20,フラッシュカードデータ!$B$4:$E$103,3,FALSE),\"\")","v":""}]
{"$rows_left_out":182}
{"sheet":"フラッシュカード(画面表示）《指定順表示》","index":4,"n_rows":201,"n_cols":4,"rows_kept":201,"cut":false,"hidden":false,"merged":[[11,0,12,0],[13,0,14,0],[15,0,16,0],[17,0,18,0],[19,0,20,0],[21,0,22,0],[1,3,1,19],[1,0,2,0],[3,0,4,0],[5,0,6,0],[7,0,8,0],[9,0,10,0],[35,0,36,0],[37,0,38,0],[39,0,40,0],[41,0,42,0],[43,0,44,0],[45,0,46,0],[23,0,24,0],[25,0,26,0],[27,0,28,0],[29,0,30,0],[31,0,32,0],[33,0,34,0],[59,0,60,0],[61,0,62,0],[63,0,64,0],[65,0,66,0],[67,0,68,0],[69,0,70,0],[47,0,48,0],[49,0,50,0],[51,0,52,0],[53,0,54,0],[55,0,56,0],[57,0,58,0],[83,0,84,0],[85,0,86,0],[87,0,88,0],[89,0,90,0],[91,0,92,0],[93,0,94,0],[71,0,72,0],[73,0,74,0],[75,0,76,0],[77,0,78,0],[79,0,80,0],[81,0,82,0],[107,0,108,0],[109,0,110,0],[111,0,112,0],[113,0,114,0],[115,0,116,0],[117,0,118,0],[95,0,96,0],[97,0,98,0],[99,0,100,0],[101,0,102,0],[103,0,104,0],[105,0,106,0],[131,0,132,0],[133,0,134,0],[135,0,136,0],[137,0,138,0],[139,0,140,0],[141,0,142,0],[119,0,120,0],[121,0,122,0],[123,0,124,0],[125,0,126,0],[127,0,128,0],[129,0,130,0],[167,0,168,0],[171,0,172,0],[181,0,182,0],[143,0,144,0],[169,0,170,0],[144,3,144,8],[145,0,146,0],[145,3,145,8],[147,0,148,0],[149,0,150,0],[151,0,152,0],[153,0,154,0],[155,0,156,0],[209,0,210,0],[2,3,2,21],[197,0,198,0],[199,0,200,0],[201,0,202,0],[203,0,204,0],[205,0,206,0],[207,0,208,0],[187,0,188,0],[189,0,190,0],[191,0,192,0],[193,0,194,0],[195,0,196,0],[173,0,174,0],[175,0,176,0],[177,0,178,0],[179,0,180,0],[185,0,186,0],[157,0,158,0],[159,0,160,0],[183,0,184,0],[161,0,162,0],[163,0,164,0],[165,0,166,0]]}
[null,{"$f":"IF(フラッシュカードデータ!$C$2=\"\",\"\",フラッシュカードデータ!$C$2)","v":"たすのかな　ひくのかな"}]
[1,{"$f":"IF(VLOOKUP($A2,フラッシュカードデータ!$C$4:$E$103,2,FALSE)=\"\",\"\",VLOOKUP($A2,フラッシュカードデータ!$C$4:$E$103,2,FALSE))","v":"　あおいさんたちは　8にんで　あそんで　いました。そこへ　ともだちが　8にん　きました。みんなで　なんにんに　なりましたか。"},null,"「フラッシュカードデータ」に入力した順に表示されます。\nセルの高さの調整や全面表示のＯＮ，ＯＦＦは，「フラッシュカード（画面表示）」のボタンを利用して行ってください。"]
[null,{"$f":"IF(VLOOKUP($A2,フラッシュカードデータ!$C$4:$E$103,3,FALSE)=\"\",\"\",VLOOKUP($A2,フラッシュカードデータ!$C$4:$E$103,3,FALSE))","v":"8＋8"},null,"カーソルキー（↑↓）を使って、\nフラッシュカードを切り替えて\n使用してください。"]
[2,{"$f":"IF(VLOOKUP($A4,フラッシュカードデータ!$C$4:$E$103,2,FALSE)=\"\",\"\",VLOOKUP($A4,フラッシュカードデータ!$C$4:$E$103,2,FALSE))","v":"　あおいさんたちは　14にんで　あそんで　いました。その　うち　7にんが　かえりました。のこっているこは　なんにんに　なりましたか。"}]
[null,{"$f":"IF(VLOOKUP($A4,フラッシュカードデータ!$C$4:$E$103,3,FALSE)=\"\",\"\",VLOOKUP($A4,フラッシュカードデータ!$C$4:$E$103,3,FALSE))","v":"14－7"}]
[3,{"$f":"IF(VLOOKUP($A6,フラッシュカードデータ!$C$4:$E$103,2,FALSE)=\"\",\"\",VLOOKUP($A6,フラッシュカードデータ!$C$4:$E$103,2,FALSE))","v":"　とりが　6わ　きに　とまっていました。そこへ　7わ　とんできました。ぜんぶで　なんわに　なりましたか。"}]
[null,{"$f":"IF(VLOOKUP($A6,フラッシュカードデータ!$C$4:$E$103,3,FALSE)=\"\",\"\",VLOOKUP($A6,フラッシュカードデータ!$C$4:$E$103,3,FALSE))","v":"6＋7"}]
[4,{"$f":"IF(VLOOKUP($A8,フラッシュカードデータ!$C$4:$E$103,2,FALSE)=\"\",\"\",VLOOKUP($A8,フラッシュカードデータ!$C$4:$E$103,2,FALSE))","v":"　とりが　10わ　きに　とまっていました。その　うち　7わ　とんでいきました。のこりは　なんわに　なりましたか。"}]
[null,{"$f":"IF(VLOOKUP($A8,フラッシュカードデータ!$C$4:$E$103,3,FALSE)=\"\",\"\",VLOOKUP($A8,フラッシュカードデータ!$C$4:$E$103,3,FALSE))","v":"10－7"}]
[5,{"$f":"IF(VLOOKUP($A10,フラッシュカードデータ!$C$4:$E$103,2,FALSE)=\"\",\"\",VLOOKUP($A10,フラッシュカードデータ!$C$4:$E$103,2,FALSE))","v":"　あおい　じてんしゃが　7だい，あかい　じてんしゃが　5だい　あります。あわせて　なんだいですか。"}]
[null,{"$f":"IF(VLOOKUP($A10,フラッシュカードデータ!$C$4:$E$103,3,FALSE)=\"\",\"\",VLOOKUP($A10,フラッシュカードデータ!$C$4:$E$103,3,FALSE))","v":"7＋5"}]
[6,{"$f":"IF(VLOOKUP($A12,フラッシュカードデータ!$C$4:$E$103,2,FALSE)=\"\",\"\",VLOOKUP($A12,フラッシュカードデータ!$C$4:$E$103,2,FALSE))","v":"　あおい　じてんしゃが　8だい，あかい　じてんしゃが　6だい　あります。どちらが　なんだい　おおいですか。"}]
[null,{"$f":"IF(VLOOKUP($A12,フラッシュカードデータ!$C$4:$E$103,3,FALSE)=\"\",\"\",VLOOKUP($A12,フラッシュカードデータ!$C$4:$E$103,3,FALSE))","v":"8－6"}]
[7,{"$f":"IF(VLOOKUP($A14,フラッシュカードデータ!$C$4:$E$103,2,FALSE)=\"\",\"\",VLOOKUP($A14,フラッシュカードデータ!$C$4:$E$103,2,FALSE))","v":""}]
[null,{"$f":"IF(VLOOKUP($A14,フラッシュカードデータ!$C$4:$E$103,3,FALSE)=\"\",\"\",VLOOKUP($A14,フラッシュカードデータ!$C$4:$E$103,3,FALSE))","v":""}]
[8,{"$f":"IF(VLOOKUP($A16,フラッシュカードデータ!$C$4:$E$103,2,FALSE)=\"\",\"\",VLOOKUP($A16,フラッシュカードデータ!$C$4:$E$103,2,FALSE))","v":""}]
[null,{"$f":"IF(VLOOKUP($A16,フラッシュカードデータ!$C$4:$E$103,3,FALSE)=\"\",\"\",VLOOKUP($A16,フラッシュカードデータ!$C$4:$E$103,3,FALSE))","v":""}]
[9,{"$f":"IF(VLOOKUP($A18,フラッシュカードデータ!$C$4:$E$103,2,FALSE)=\"\",\"\",VLOOKUP($A18,フラッシュカードデータ!$C$4:$E$103,2,FALSE))","v":""}]
[null,{"$f":"IF(VLOOKUP($A18,フラッシュカードデータ!$C$4:$E$103,3,FALSE)=\"\",\"\",VLOOKUP($A18,フラッシュカードデータ!$C$4:$E$103,3,FALSE))","v":""}]
[10,{"$f":"IF(VLOOKUP($A20,フラッシュカードデータ!$C$4:$E$103,2,FALSE)=\"\",\"\",VLOOKUP($A20,フラッシュカードデータ!$C$4:$E$103,2,FALSE))","v":""}]
{"$rows_left_out":182}
{"sheet":"フラッシュカード(横長印刷用）","index":5,"n_rows":201,"n_cols":4,"rows_kept":201,"cut":false,"hidden":false,"merged":[[2,3,2,8],[1,3,1,8],[205,0,206,0],[207,0,208,0],[209,0,210,0],[193,0,194,0],[195,0,196,0],[197,0,198,0],[199,0,200,0],[201,0,202,0],[191,0,192,0],[145,0,146,0],[147,0,148,0],[149,0,150,0],[151,0,152,0],[153,0,154,0],[155,0,156,0],[203,0,204,0],[169,0,170,0],[171,0,172,0],[173,0,174,0],[175,0,176,0],[177,0,178,0],[179,0,180,0],[181,0,182,0],[183,0,184,0],[185,0,186,0],[159,0,160,0],[161,0,162,0],[163,0,164,0],[165,0,166,0],[167,0,168,0],[157,0,158,0],[129,0,130,0],[187,0,188,0],[189,0,190,0],[143,0,144,0],[97,0,98,0],[99,0,100,0],[101,0,102,0],[103,0,104,0],[105,0,106,0],[107,0,108,0],[109,0,110,0],[111,0,112,0],[113,0,114,0],[131,0,132,0],[133,0,134,0],[135,0,136,0],[137,0,138,0],[139,0,140,0],[121,0,122,0],[123,0,124,0],[125,0,126,0],[127,0,128,0],[141,0,142,0],[115,0,116,0],[117,0,118,0],[119,0,120,0],[73,0,74,0],[75,0,76,0],[77,0,78,0],[79,0,80,0],[81,0,82,0],[83,0,84,0],[85,0,86,0],[93,0,94,0],[95,0,96,0],[49,0,50,0],[51,0,52,0],[53,0,54,0],[55,0,56,0],[57,0,58,0],[65,0,66,0],[67,0,68,0],[69,0,70,0],[87,0,88,0],[89,0,90,0],[91,0,92,0],[71,0,72,0],[25,0,26,0],[27,0,28,0],[29,0,30,0],[31,0,32,0],[33,0,34,0],[35,0,36,0],[59,0,60,0],[61,0,62,0],[63,0,64,0],[1,0,2,0],[3,0,4,0],[5,0,6,0],[7,0,8,0],[9,0,10,0],[11,0,12,0],[47,0,48,0],[37,0,38,0],[39,0,40,0],[13,0,14,0],[15,0,16,0],[17,0,18,0],[41,0,42,0],[19,0,20,0],[21,0,22,0],[23,0,24,0],[43,0,44,0],[45,0,46,0]]}
[null,{"$f":"IF(フラッシュカードデータ!$C$2=\"\",\"\",フラッシュカードデータ!$C$2)","v":"たすのかな　ひくのかな"}]
[1,{"$f":"IF(VLOOKUP($A2,フラッシュカードデータ!$C$4:$E$103,2,FALSE)=\"\",\"\",VLOOKUP($A2,フラッシュカードデータ!$C$4:$E$103,2,FALSE))","v":"　あおいさんたちは　8にんで　あそんで　いました。そこへ　ともだちが　8にん　きました。みんなで　なんにんに　なりましたか。"},null,"A4用紙（横向き)に\n印刷されます。"]
[null,{"$f":"IF(VLOOKUP($A2,フラッシュカードデータ!$C$4:$E$103,3,FALSE)=\"\",\"\",VLOOKUP($A2,フラッシュカードデータ!$C$4:$E$103,3,FALSE))","v":"8＋8"},null,"真ん中で折って、\n貼り合わせると\nフラッシュカードが\nできあがります。"]
[2,{"$f":"IF(VLOOKUP($A4,フラッシュカードデータ!$C$4:$E$103,2,FALSE)=\"\",\"\",VLOOKUP($A4,フラッシュカードデータ!$C$4:$E$103,2,FALSE))","v":"　あおいさんたちは　14にんで　あそんで　いました。その　うち　7にんが　かえりました。のこっているこは　なんにんに　なりましたか。"}]
[null,{"$f":"IF(VLOOKUP($A4,フラッシュカードデータ!$C$4:$E$103,3,FALSE)=\"\",\"\",VLOOKUP($A4,フラッシュカードデータ!$C$4:$E$103,3,FALSE))","v":"14－7"}]
[3,{"$f":"IF(VLOOKUP($A6,フラッシュカードデータ!$C$4:$E$103,2,FALSE)=\"\",\"\",VLOOKUP($A6,フラッシュカードデータ!$C$4:$E$103,2,FALSE))","v":"　とりが　6わ　きに　とまっていました。そこへ　7わ　とんできました。ぜんぶで　なんわに　なりましたか。"}]
[null,{"$f":"IF(VLOOKUP($A6,フラッシュカードデータ!$C$4:$E$103,3,FALSE)=\"\",\"\",VLOOKUP($A6,フラッシュカードデータ!$C$4:$E$103,3,FALSE))","v":"6＋7"}]
[4,{"$f":"IF(VLOOKUP($A8,フラッシュカードデータ!$C$4:$E$103,2,FALSE)=\"\",\"\",VLOOKUP($A8,フラッシュカードデータ!$C$4:$E$103,2,FALSE))","v":"　とりが　10わ　きに　とまっていました。その　うち　7わ　とんでいきました。のこりは　なんわに　なりましたか。"}]
[null,{"$f":"IF(VLOOKUP($A8,フラッシュカードデータ!$C$4:$E$103,3,FALSE)=\"\",\"\",VLOOKUP($A8,フラッシュカードデータ!$C$4:$E$103,3,FALSE))","v":"10－7"}]
[5,{"$f":"IF(VLOOKUP($A10,フラッシュカードデータ!$C$4:$E$103,2,FALSE)=\"\",\"\",VLOOKUP($A10,フラッシュカードデータ!$C$4:$E$103,2,FALSE))","v":"　あおい　じてんしゃが　7だい，あかい　じてんしゃが　5だい　あります。あわせて　なんだいですか。"}]
[null,{"$f":"IF(VLOOKUP($A10,フラッシュカードデータ!$C$4:$E$103,3,FALSE)=\"\",\"\",VLOOKUP($A10,フラッシュカードデータ!$C$4:$E$103,3,FALSE))","v":"7＋5"}]
[6,{"$f":"IF(VLOOKUP($A12,フラッシュカードデータ!$C$4:$E$103,2,FALSE)=\"\",\"\",VLOOKUP($A12,フラッシュカードデータ!$C$4:$E$103,2,FALSE))","v":"　あおい　じてんしゃが　8だい，あかい　じてんしゃが　6だい　あります。どちらが　なんだい　おおいですか。"}]
[null,{"$f":"IF(VLOOKUP($A12,フラッシュカードデータ!$C$4:$E$103,3,FALSE)=\"\",\"\",VLOOKUP($A12,フラッシュカードデータ!$C$4:$E$103,3,FALSE))","v":"8－6"}]
[7,{"$f":"IF(VLOOKUP($A14,フラッシュカードデータ!$C$4:$E$103,2,FALSE)=\"\",\"\",VLOOKUP($A14,フラッシュカードデータ!$C$4:$E$103,2,FALSE))","v":""}]
[null,{"$f":"IF(VLOOKUP($A14,フラッシュカードデータ!$C$4:$E$103,3,FALSE)=\"\",\"\",VLOOKUP($A14,フラッシュカードデータ!$C$4:$E$103,3,FALSE))","v":""}]
[8,{"$f":"IF(VLOOKUP($A16,フラッシュカードデータ!$C$4:$E$103,2,FALSE)=\"\",\"\",VLOOKUP($A16,フラッシュカードデータ!$C$4:$E$103,2,FALSE))","v":""}]
[null,{"$f":"IF(VLOOKUP($A16,フラッシュカードデータ!$C$4:$E$103,3,FALSE)=\"\",\"\",VLOOKUP($A16,フラッシュカードデータ!$C$4:$E$103,3,FALSE))","v":""}]
[9,{"$f":"IF(VLOOKUP($A18,フラッシュカードデータ!$C$4:$E$103,2,FALSE)=\"\",\"\",VLOOKUP($A18,フラッシュカードデータ!$C$4:$E$103,2,FALSE))","v":""}]
[null,{"$f":"IF(VLOOKUP($A18,フラッシュカードデータ!$C$4:$E$103,3,FALSE)=\"\",\"\",VLOOKUP($A18,フラッシュカードデータ!$C$4:$E$103,3,FALSE))","v":""}]
[10,{"$f":"IF(VLOOKUP($A20,フラッシュカードデータ!$C$4:$E$103,2,FALSE)=\"\",\"\",VLOOKUP($A20,フラッシュカードデータ!$C$4:$E$103,2,FALSE))","v":""}]
{"$rows_left_out":182}
{"sheet":"フラッシュカード(横短印刷用）","index":6,"n_rows":201,"n_cols":4,"rows_kept":201,"cut":false,"hidden":false,"merged":[[205,0,206,0],[207,0,208,0],[209,0,210,0],[189,0,190,0],[191,0,192,0],[193,0,194,0],[195,0,196,0],[197,0,198,0],[199,0,200,0],[177,0,178,0],[179,0,180,0],[181,0,182,0],[183,0,184,0],[185,0,186,0],[187,0,188,0],[201,0,202,0],[203,0,204,0],[159,0,160,0],[161,0,162,0],[163,0,164,0],[165,0,166,0],[167,0,168,0],[169,0,170,0],[171,0,172,0],[173,0,174,0],[175,0,176,0],[141,0,142,0],[143,0,144,0],[145,0,146,0],[147,0,148,0],[149,0,150,0],[151,0,152,0],[153,0,154,0],[155,0,156,0],[157,0,158,0],[123,0,124,0],[125,0,126,0],[127,0,128,0],[129,0,130,0],[131,0,132,0],[133,0,134,0],[135,0,136,0],[137,0,138,0],[139,0,140,0],[105,0,106,0],[107,0,108,0],[109,0,110,0],[111,0,112,0],[113,0,114,0],[115,0,116,0],[117,0,118,0],[119,0,120,0],[121,0,122,0],[87,0,88,0],[89,0,90,0],[91,0,92,0],[93,0,94,0],[95,0,96,0],[97,0,98,0],[99,0,100,0],[101,0,102,0],[103,0,104,0],[69,0,70,0],[71,0,72,0],[73,0,74,0],[75,0,76,0],[77,0,78,0],[79,0,80,0],[81,0,82,0],[83,0,84,0],[85,0,86,0],[51,0,52,0],[53,0,54,0],[55,0,56,0],[57,0,58,0],[59,0,60,0],[61,0,62,0],[63,0,64,0],[65,0,66,0],[67,0,68,0],[33,0,34,0],[35,0,36,0],[37,0,38,0],[39,0,40,0],[41,0,42,0],[43,0,44,0],[45,0,46,0],[47,0,48,0],[49,0,50,0],[15,0,16,0],[17,0,18,0],[19,0,20,0],[21,0,22,0],[23,0,24,0],[25,0,26,0],[27,0,28,0],[29,0,30,0],[31,0,32,0],[1,0,2,0],[1,3,1,8],[2,3,2,8],[3,0,4,0],[5,0,6,0],[7,0,8,0],[9,0,10,0],[11,0,12,0],[13,0,14,0]]}
[null,{"$f":"IF(フラッシュカードデータ!$C$2=\"\",\"\",フラッシュカードデータ!$C$2)","v":"たすのかな　ひくのかな"}]
[1,{"$f":"IF(VLOOKUP($A2,フラッシュカードデータ!$C$4:$E$103,2,FALSE)=\"\",\"\",VLOOKUP($A2,フラッシュカードデータ!$C$4:$E$103,2,FALSE))","v":"　あおいさんたちは　8にんで　あそんで　いました。そこへ　ともだちが　8にん　きました。みんなで　なんにんに　なりましたか。"},null,"A4用紙（縦向き)に\n印刷されます。"]
[null,{"$f":"IF(VLOOKUP($A2,フラッシュカードデータ!$C$4:$E$103,3,FALSE)=\"\",\"\",VLOOKUP($A2,フラッシュカードデータ!$C$4:$E$103,3,FALSE))","v":"8＋8"},null,"真ん中で折って、\n貼り合わせると\nフラッシュカードが\nできあがります。"]
[2,{"$f":"IF(VLOOKUP($A4,フラッシュカードデータ!$C$4:$E$103,2,FALSE)=\"\",\"\",VLOOKUP($A4,フラッシュカードデータ!$C$4:$E$103,2,FALSE))","v":"　あおいさんたちは　14にんで　あそんで　いました。その　うち　7にんが　かえりました。のこっているこは　なんにんに　なりましたか。"}]
[null,{"$f":"IF(VLOOKUP($A4,フラッシュカードデータ!$C$4:$E$103,3,FALSE)=\"\",\"\",VLOOKUP($A4,フラッシュカードデータ!$C$4:$E$103,3,FALSE))","v":"14－7"}]
[3,{"$f":"IF(VLOOKUP($A6,フラッシュカードデータ!$C$4:$E$103,2,FALSE)=\"\",\"\",VLOOKUP($A6,フラッシュカードデータ!$C$4:$E$103,2,FALSE))","v":"　とりが　6わ　きに　とまっていました。そこへ　7わ　とんできました。ぜんぶで　なんわに　なりましたか。"}]
[null,{"$f":"IF(VLOOKUP($A6,フラッシュカードデータ!$C$4:$E$103,3,FALSE)=\"\",\"\",VLOOKUP($A6,フラッシュカードデータ!$C$4:$E$103,3,FALSE))","v":"6＋7"}]
[4,{"$f":"IF(VLOOKUP($A8,フラッシュカードデータ!$C$4:$E$103,2,FALSE)=\"\",\"\",VLOOKUP($A8,フラッシュカードデータ!$C$4:$E$103,2,FALSE))","v":"　とりが　10わ　きに　とまっていました。その　うち　7わ　とんでいきました。のこりは　なんわに　なりましたか。"}]
[null,{"$f":"IF(VLOOKUP($A8,フラッシュカードデータ!$C$4:$E$103,3,FALSE)=\"\",\"\",VLOOKUP($A8,フラッシュカードデータ!$C$4:$E$103,3,FALSE))","v":"10－7"}]
[5,{"$f":"IF(VLOOKUP($A10,フラッシュカードデータ!$C$4:$E$103,2,FALSE)=\"\",\"\",VLOOKUP($A10,フラッシュカードデータ!$C$4:$E$103,2,FALSE))","v":"　あおい　じてんしゃが　7だい，あかい　じてんしゃが　5だい　あります。あわせて　なんだいですか。"}]
[null,{"$f":"IF(VLOOKUP($A10,フラッシュカードデータ!$C$4:$E$103,3,FALSE)=\"\",\"\",VLOOKUP($A10,フラッシュカードデータ!$C$4:$E$103,3,FALSE))","v":"7＋5"}]
[6,{"$f":"IF(VLOOKUP($A12,フラッシュカードデータ!$C$4:$E$103,2,FALSE)=\"\",\"\",VLOOKUP($A12,フラッシュカードデータ!$C$4:$E$103,2,FALSE))","v":"　あおい　じてんしゃが　8だい，あかい　じてんしゃが　6だい　あります。どちらが　なんだい　おおいですか。"}]
[null,{"$f":"IF(VLOOKUP($A12,フラッシュカードデータ!$C$4:$E$103,3,FALSE)=\"\",\"\",VLOOKUP($A12,フラッシュカードデータ!$C$4:$E$103,3,FALSE))","v":"8－6"}]
[7,{"$f":"IF(VLOOKUP($A14,フラッシュカードデータ!$C$4:$E$103,2,FALSE)=\"\",\"\",VLOOKUP($A14,フラッシュカードデータ!$C$4:$E$103,2,FALSE))","v":""}]
[null,{"$f":"IF(VLOOKUP($A14,フラッシュカードデータ!$C$4:$E$103,3,FALSE)=\"\",\"\",VLOOKUP($A14,フラッシュカードデータ!$C$4:$E$103,3,FALSE))","v":""}]
[8,{"$f":"IF(VLOOKUP($A16,フラッシュカードデータ!$C$4:$E$103,2,FALSE)=\"\",\"\",VLOOKUP($A16,フラッシュカードデータ!$C$4:$E$103,2,FALSE))","v":""}]
[null,{"$f":"IF(VLOOKUP($A16,フラッシュカードデータ!$C$4:$E$103,3,FALSE)=\"\",\"\",VLOOKUP($A16,フラッシュカードデータ!$C$4:$E$103,3,FALSE))","v":""}]
[9,{"$f":"IF(VLOOKUP($A18,フラッシュカードデータ!$C$4:$E$103,2,FALSE)=\"\",\"\",VLOOKUP($A18,フラッシュカードデータ!$C$4:$E$103,2,FALSE))","v":""}]
[null,{"$f":"IF(VLOOKUP($A18,フラッシュカードデータ!$C$4:$E$103,3,FALSE)=\"\",\"\",VLOOKUP($A18,フラッシュカードデータ!$C$4:$E$103,3,FALSE))","v":""}]
[10,{"$f":"IF(VLOOKUP($A20,フラッシュカードデータ!$C$4:$E$103,2,FALSE)=\"\",\"\",VLOOKUP($A20,フラッシュカードデータ!$C$4:$E$103,2,FALSE))","v":""}]
{"$rows_left_out":181}