{"text_format":"1","workbook":"xlsx","n_sheets":6,"sheets":["使い方","フラッシュカードデータ","フラッシュカード(画面表示）","フラッシュカード(画面表示）《指定順表示》","フラッシュカード(横長印刷用）","フラッシュカード(横短印刷用）"],"not_rendered":{"charts":0,"images":0,"macros":1,"external_links":0,"defined_names":4,"comments":0,"pivot_tables":0},"unopened":[],"bounds":{"document_bytes":16777216,"sheet_cells":100000,"rows_first":2000,"rows_last":500,"rows_between":2000,"halvings":0,"cell_chars":16384,"cell_head_chars":4096},"cells_cut":0,"cells_raw":0,"read":"whole","date_system":"1900"}

{"sheet":"使い方","index":0,"n_rows":38,"n_cols":3,"rows_kept":38,"cut":false,"hidden":false,"merged":[]}
["Microsoft Excel で フラッシュカードを作ろう（テキスト用）"]
[]
["このファイルは，両面にテキストデータを扱うためのものです。"]
["「Microsoft Excel で フラッシュカードを作ろう」のすべてのもとになったものです。"]
["使用する機器に合わせた，セルの高さ調整などはこのファイルであらかじめ数値を確認しておくと便利です。"]
[]
["このワークシートを使うことで、ディスプレイやプロジェクターをフラッシュカードのように使ったり、"]
["通常のフラッシュカードを作成したりすることが手軽にできます。"]
["使い方は、下記の通りです。"]
[]
[1,"「フラッシュカードデータ」の表に、データを入力します。"]
[null,null,"タイトルをセルC2に入力する。"]
[null,null,"データの入力範囲は、\"D4:E103\"です。"]
[]
[2,"「フラッシュカード(画面表示）」「フラッシュカード(画面表示）《指定順表示》」で、"]
[null,"フラッシュカードをディスプレイやプロジェクターで表示します。"]
[null,null,"画面のサイズに合わせて、タイトル行やカード行の高さを変えたり、"]
[null,null,"Excelの表示倍率を変えたりして、フラッシュカードがちょうどよく"]
[null,null,"表示されるようにします。"]
[null,null,"カーソルキー（↑↓）を使って、フラッシュカードの表、裏を切り替えます。"]
[null,null,"ファンクションキー「F9」を押すことで、表示する順番が変わります。"]
[]
[3,"「フラッシュカード(印刷用）」で、フラッシュカードを作成します。"]
[null,null,"横長印刷用では，A4用紙の横向きに印刷をします。"]
[null,null,"横短印刷用では，A4用紙の縦向きに印刷をします。"]
[null,null,"印刷されたら、2つ折りにしてのり付けすれば、フラッシュカードが作成できます。"]
[]
[4,"「フラッシュカード(画面表示）」「フラッシュカード(画面表示）《指定順表示》」で、"]
[null,"タイトルの表示をON,OFFするには，下のボタンを押してください。"]
[]
{"$rows_left_out":9}
{"sheet":"フラッシュカードデータ","index":1,"n_rows":103,"n_cols":7,"rows_kept":103,"cut":false,"hidden":false,"merged":[[1,2,1,4],[0,6,1,8]]}
[null,null,"フラッシュカードデータ",null,null,null,"フラッシュカード\n（画面表示）"]
[null,null,"数字でかきましょう"]
[null,null,"№","表","裏"]
[{"$f":"IF(D4=\"\",\"\",RAND())","v":0.65272055238679927},{"$f":"IF(A4=\"\",\"\",RANK(A4,$A$4:$A$103))","v":40},1,{"$f":"INT(RAND()*9+1)*100+INT(RAND()*99)","v":920},{"$f":"D4","v":920}]
[{"$f":"IF(D5=\"\",\"\",RAND())","v":0.25507409993737606},{"$f":"IF(A5=\"\",\"\",RANK(A5,$A$4:$A$103))","v":77},2,{"$f":"INT(RAND()*9+1)*100+INT(RAND()*99)","v":672},{"$f":"D5","v":672}]
[0.80924338136817531,23,3,496,496]
[0.73762963152893235,29,4,545,545]
[4.1714821203530095E-3,99,5,260,260]
[0.71057412235012607,32,6,473,473]
[0.5904475577955608,47,7,176,176]
[0.17286276128260458,87,8,850,850]
[2.7010433755759289E-2,95,9,523,523]
[5.7858403209823939E-3,97,10,933,933]
[0.26662201538786401,76,11,855,855]
[0.5366672542908032,51,12,674,674,null,"←左の表に"]
[0.16529250908608739,88,13,151,151,null,"フラッシュカードの表・裏に"]
[0.42579800995068739,58,14,847,847,null,"表示するデータを入力します。"]
[0.66692223368761683,37,15,449,449]
[0.43409217849220494,55,16,797,797]
[0.73823771813594752,28,17,338,338]
[0.65972140821413727,38,18,172,172]
[4.9019199496584953E-2,93,19,113,113]
[0.37222230398594602,64,20,756,756]
[0.76578930254225508,25,21,453,453]
[0.97855158730040581,3,22,231,231]
[0.91458580400027811,10,23,284,284]
[0.26929594345995944,75,24,930,930]
[0.34950566712518427,67,25,825,825]
[0.53762787938871515,50,26,160,160]
[0.22702253897064739,79,27,118,118]
{"$rows_left_out":74}
{"sheet":"フラッシュカード(画面表示）","index":2,"n_rows":201,"n_cols":17,"rows_kept":201,"cut":false,"hidden":false,"merged":[[0,16,0,17],[0,10,0,11],[25,0,26,0],[27,0,28,0],[29,0,30,0],[31,0,32,0],[1,3,1,21],[2,3,2,21],[33,0,34,0],[1,0,2,0],[3,0,4,0],[5,0,6,0],[7,0,8,0],[9,0,10,0],[11,0,12,0],[147,3,147,26],[13,0,14,0],[15,0,16,0],[17,0,18,0],[19,0,20,0],[21,0,22,0],[23,0,24,0],[37,0,38,0],[39,0,40,0],[71,0,72,0],[49,0,50,0],[51,0,52,0],[53,0,54,0],[55,0,56,0],[57,0,58,0],[59,0,60,0],[35,0,36,0],[61,0,62,0],[63,0,64,0],[65,0,66,0],[67,0,68,0],[69,0,70,0],[43,0,44,0],[45,0,46,0],[47,0,48,0],[41,0,42,0],[73,0,74,0],[75,0,76,0],[77,0,78,0],[79,0,80,0],[81,0,82,0],[83,0,84,0],[85,0,86,0],[87,0,88,0],[89,0,90,0],[91,0,92,0],[93,0,94,0],[95,0,96,0],[97,0,98,0],[99,0,100,0],[101,0,102,0],[103,0,104,0],[105,0,106,0],[107,0,108,0],[109,0,110,0],[111,0,112,0],[113,0,114,0],[115,0,116,0],[117,0,118,0],[119,0,120,0],[121,0,122,0],[123,0,124,0],[125,0,126,0],[127,0,128,0],[129,0,130,0],[131,0,132,0],[133,0,134,0],[135,0,136,0],[137,0,138,0],[139,0,140,0],[141,0,142,0],[143,0,144,0],[145,0,146,0],[147,0,148,0],[149,0,150,0],[151,0,152,0],[153,0,154,0],[155,0,156,0],[157,0,158,0],[159,0,160,0],[161,0,162,0],[163,0,164,0],[165,0,166,0],[167,0,168,0],[169,0,170,0],[171,0,172,0],[173,0,174,0],[175,0,176,0],[177,0,178,0],[179,0,180,0],[181,0,182,0],[183,0,184,0],[185,0,186,0],[187,0,188,0],[189,0,190,0],[191,0,192,0],[205,0,206,0],[207,0,208,0],[209,0,210,0],[193,0,194,0],[195,0,196,0],[197,0,198,0],[199,0,200,0],[201,0,202,0],[203,0,204,0]]}
[null,{"$f":"IF(フラッシュカードデータ!$C$2=\"\",\"\",フラッシュカードデータ!$C$2)","v":"数字でかきましょう"},null,null,null,null,null,null,null,null,100,null,null,null,null,null,409]
[1,{"$f":"IFERROR(VLOOKUP($A2,フラッシュカードデータ!$B$4:$E$103,3,FALSE),\"\")","v":643},null,"表示機器にあわせて\n行の高さや\n表示倍率を調節してください。"]
[null,{"$f":"IFERROR(VLOOKUP($A2,フラッシュカードデータ!$B$4:$E$103,4,FALSE),\"\")","v":643},null,"カーソルキー（↑↓）を使って、\nフラッシュカードを切り替えて\n使用してください。"]
[2,{"$f":"IFERROR(VLOOKUP($A4,フラッシュカードデータ!$B$4:$E$103,3,FALSE),\"\")","v":771}]
[null,{"$f":"IFERROR(VLOOKUP($A4,フラッシュカードデータ!$B$4:$E$103,4,FALSE),\"\")","v":771}]
[3,{"$f":"IFERROR(VLOOKUP($A6,フラッシュカードデータ!$B$4:$E$103,3,FALSE),\"\")","v":231}]
[null,{"$f":"IFERROR(VLOOKUP($A6,フラッシュカードデータ!$B$4:$E$103,4,FALSE),\"\")","v":231}]
[4,{"$f":"IFERROR(VLOOKUP($A8,フラッシュカードデータ!$B$4:$E$103,3,FALSE),\"\")","v":880}]
[null,{"$f":"IFERROR(VLOOKUP($A8,フラッシュカードデータ!$B$4:$E$103,4,FALSE),\"\")","v":880}]
[5,{"$f":"IFERROR(VLOOKUP($A10,フラッシュカードデータ!$B$4:$E$103,3,FALSE),\"\")","v":371}]
[null,{"$f":"IFERROR(VLOOKUP($A10,フラッシュカードデータ!$B$4:$E$103,4,FALSE),\"\")","v":371}]
[6,{"$f":"IFERROR(VLOOKUP($A12,フラッシュカードデータ!$B$4:$E$103,3,FALSE),\"\")","v":838}]
[null,{"$f":"IFERROR(VLOOKUP($A12,フラッシュカードデータ!$B$4:$E$103,4,FALSE),\"\")","v":838}]
[7,{"$f":"IFERROR(VLOOKUP($A14,フラッシュカードデータ!$B$4:$E$103,3,FALSE),\"\")","v":891}]
[null,{"$f":"IFERROR(VLOOKUP($A14,フラッシュカードデータ!$B$4:$E$103,4,FALSE),\"\")","v":891}]
[8,{"$f":"IFERROR(VLOOKUP($A16,フラッシュカードデータ!$B$4:$E$103,3,FALSE),\"\")","v":664}]
[null,{"$f":"IFERROR(VLOOKUP($A16,フラッシュカードデータ!$B$4:$E$103,4,FALSE),\"\")","v":664}]
[9,{"$f":"IFERROR(VLOOKUP($A18,フラッシュカードデータ!$B$4:$E$103,3,FALSE),\"\")","v":349}]
[null,{"$f":"IFERROR(VLOOKUP($A18,フラッシュカードデータ!$B$4:$E$103,4,FALSE),\"\")","v":349}]
[10,{"$f":"IFERROR(VLOOKUP($A20,フラッシュカードデータ!$B$4:$E$103,3,FALSE),\"\")","v":284}]
[null,{"$f":"IFERROR(VLOOKUP($A20,フラッシュカードデータ!$B$4:$E$103,4,FALSE),\"\")","v":284}]
[11,{"$f":"IFERROR(VLOOKUP($A22,フラッシュカードデータ!$B$4:$E$103,3,FALSE),\"\")","v":553}]
[null,{"$f":"IFERROR(VLOOKUP($A22,フラッシュカードデータ!$B$4:$E$103,4,FALSE),\"\")","v":553}]
[12,{"$f":"IFERROR(VLOOKUP($A24,フラッシュカードデータ!$B$4:$E$103,3,FALSE),\"\")","v":989}]
[null,{"$f":"IFERROR(VLOOKUP($A24,フラッシュカードデータ!$B$4:$E$103,4,FALSE),\"\")","v":989}]
[13,{"$f":"IFERROR(VLOOKUP($A26,フラッシュカードデータ!$B$4:$E$103,3,FALSE),\"\")","v":153}]
[null,{"$f":"IFERROR(VLOOKUP($A26,フラッシュカードデータ!$B$4:$E$103,4,FALSE),\"\")","v":153}]
[14,{"$f":"IFERROR(VLOOKUP($A28,フラッシュカードデータ!$B$4:$E$103,3,FALSE),\"\")","v":327}]
[null,{"$f":"IFERROR(VLOOKUP($A28,フラッシュカードデータ!$B$4:$E$103,4,FALSE),\"\")","v":327}]
[15,{"$f":"IFERROR(VLOOKUP($A30,フラッシュカードデータ!$B$4:$E$103,3,FALSE),\"\")","v":196}]
{"$rows_left_out":172}
{"sheet":"フラッシュカード(画面表示）《指定順表示》","index":3,"n_rows":201,"n_cols":4,"rows_kept":201,"cut":false,"hidden":false,"merged":[[1,3,1,19],[1,0,2,0],[3,0,4,0],[5,0,6,0],[7,0,8,0],[9,0,10,0],[11,0,12,0],[13,0,14,0],[15,0,16,0],[17,0,18,0],[19,0,20,0],[21,0,22,0],[23,0,24,0],[25,0,26,0],[27,0,28,0],[29,0,30,0],[31,0,32,0],[33,0,34,0],[35,0,36,0],[37,0,38,0],[39,0,40,0],[41,0,42,0],[43,0,44,0],[45,0,46,0],[47,0,48,0],[49,0,50,0],[51,0,52,0],[53,0,54,0],[55,0,56,0],[57,0,58,0],[59,0,60,0],[61,0,62,0],[63,0,64,0],[65,0,66,0],[67,0,68,0],[69,0,70,0],[71,0,72,0],[73,0,74,0],[75,0,76,0],[77,0,78,0],[79,0,80,0],[81,0,82,0],[83,0,84,0],[85,0,86,0],[87,0,88,0],[89,0,90,0],[91,0,92,0],[93,0,94,0],[95,0,96,0],[97,0,98,0],[99,0,100,0],[101,0,102,0],[103,0,104,0],[105,0,106,0],[107,0,108,0],[109,0,110,0],[111,0,112,0],[113,0,114,0],[115,0,116,0],[117,0,118,0],[119,0,120,0],[121,0,122,0],[123,0,124,0],[125,0,126,0],[127,0,128,0],[129,0,130,0],[131,0,132,0],[133,0,134,0],[135,0,136,0],[137,0,138,0],[139,0,140,0],[141,0,142,0],[143,0,144,0],[169,0,170,0],[144,3,144,8],[145,0,146,0],[145,3,145,8],[147,0,148,0],[149,0,150,0],[151,0,152,0],[153,0,154,0],[155,0,156,0],[157,0,158,0],[159,0,160,0],[183,0,184,0],[161,0,162,0],[163,0,164,0],[165,0,166,0],[167,0,168,0],[171,0,172,0],[181,0,182,0],[191,0,192,0],[193,0,194,0],[195,0,196,0],[173,0,174,0],[175,0,176,0],[177,0,178,0],[179,0,180,0],[185,0,186,0],[209,0,210,0],[2,3,2,21],[197,0,198,0],[199,0,200,0],[201,0,202,0],[203,0,204,0],[205,0,206,0],[207,0,208,0],[187,0,188,0],[189,0,190,0]]}
[null,{"$f":"IF(フラッシュカードデータ!$C$2=\"\",\"\",フラッシュカードデータ!$C$2)","v":"数字でかきましょう"}]
[1,{"$f":"IF(VLOOKUP($A2,フラッシュカードデータ!$C$4:$E$103,2,FALSE)=\"\",\"\",VLOOKUP($A2,フラッシュカードデータ!$C$4:$E$103,2,FALSE))","v":920},null,"「フラッシュカードデータ」に入力した順に表示されます。\nセルの高さの調整や全面表示のＯＮ，ＯＦＦは，「フラッシュカード（画面表示）」のボタンを利用して行ってください。"]
[null,{"$f":"IF(VLOOKUP($A2,フラッシュカードデータ!$C$4:$E$103,3,FALSE)=\"\",\"\",VLOOKUP($A2,フラッシュカードデータ!$C$4:$E$103,3,FALSE))","v":920},null,"カーソルキー（↑↓）を使って、\nフラッシュカードを切り替えて\n使用してください。"]
[2,{"$f":"IF(VLOOKUP($A4,フラッシュカードデータ!$C$4:$E$103,2,FALSE)=\"\",\"\",VLOOKUP($A4,フラッシュカードデータ!$C$4:$E$103,2,FALSE))","v":672}]
[null,{"$f":"IF(VLOOKUP($A4,フラッシュカードデータ!$C$4:$E$103,3,FALSE)=\"\",\"\",VLOOKUP($A4,フラッシュカードデータ!$C$4:$E$103,3,FALSE))","v":672}]
[3,{"$f":"IF(VLOOKUP($A6,フラッシュカードデータ!$C$4:$E$103,2,FALSE)=\"\",\"\",VLOOKUP($A6,フラッシュカードデータ!$C$4:$E$103,2,FALSE))","v":496}]
[null,{"$f":"IF(VLOOKUP($A6,フラッシュカードデータ!$C$4:$E$103,3,FALSE)=\"\",\"\",VLOOKUP($A6,フラッシュカードデータ!$C$4:$E$103,3,FALSE))","v":496}]
[4,{"$f":"IF(VLOOKUP($A8,フラッシュカードデータ!$C$4:$E$103,2,FALSE)=\"\",\"\",VLOOKUP($A8,フラッシュカードデータ!$C$4:$E$103,2,FALSE))","v":545}]
[null,{"$f":"IF(VLOOKUP($A8,フラッシュカードデータ!$C$4:$E$103,3,FALSE)=\"\",\"\",VLOOKUP($A8,フラッシュカードデータ!$C$4:$E$103,3,FALSE))","v":545}]
[5,{"$f":"IF(VLOOKUP($A10,フラッシュカードデータ!$C$4:$E$103,2,FALSE)=\"\",\"\",VLOOKUP($A10,フラッシュカードデータ!$C$4:$E$103,2,FALSE))","v":260}]
[null,{"$f":"IF(VLOOKUP($A10,フラッシュカードデータ!$C$4:$E$103,3,FALSE)=\"\",\"\",VLOOKUP($A10,フラッシュカードデータ!$C$4:$E$103,3,FALSE))","v":260}]
[6,{"$f":"IF(VLOOKUP($A12,フラッシュカードデータ!$C$4:$E$103,2,FALSE)=\"\",\"\",VLOOKUP($A12,フラッシュカードデータ!$C$4:$E$103,2,FALSE))","v":473}]
[null,{"$f":"IF(VLOOKUP($A12,フラッシュカードデータ!$C$4:$E$103,3,FALSE)=\"\",\"\",VLOOKUP($A12,フラッシュカードデータ!$C$4:$E$103,3,FALSE))","v":473}]
[7,{"$f":"IF(VLOOKUP($A14,フラッシュカードデータ!$C$4:$E$103,2,FALSE)=\"\",\"\",VLOOKUP($A14,フラッシュカードデータ!$C$4:$E$103,2,FALSE))","v":176}]
[null,{"$f":"IF(VLOOKUP($A14,フラッシュカードデータ!$C$4:$E$103,3,FALSE)=\"\",\"\",VLOOKUP($A14,フラッシュカードデータ!$C$4:$E$103,3,FALSE))","v":176}]
[8,{"$f":"IF(VLOOKUP($A16,フラッシュカードデータ!$C$4:$E$103,2,FALSE)=\"\",\"\",VLOOKUP($A16,フラッシュカードデータ!$C$4:$E$103,2,FALSE))","v":850}]
[null,{"$f":"IF(VLOOKUP($A16,フラッシュカードデータ!$C$4:$E$103,3,FALSE)=\"\",\"\",VLOOKUP($A16,フラッシュカードデータ!$C$4:$E$103,3,FALSE))","v":850}]
[9,{"$f":"IF(VLOOKUP($A18,フラッシュカードデータ!$C$4:$E$103,2,FALSE)=\"\",\"\",VLOOKUP($A18,フラッシュカードデータ!$C$4:$E$103,2,FALSE))","v":523}]
[null,{"$f":"IF(VLOOKUP($A18,フラッシュカードデータ!$C$4:$E$103,3,FALSE)=\"\",\"\",VLOOKUP($A18,フラッシュカードデータ!$C$4:$E$103,3,FALSE))","v":523}]
[10,{"$f":"IF(VLOOKUP($A20,フラッシュカードデータ!$C$4:$E$103,2,FALSE)=\"\",\"\",VLOOKUP($A20,フラッシュカードデータ!$C$4:$E$103,2,FALSE))","v":933}]
[null,{"$f":"IF(VLOOKUP($A20,フラッシュカードデータ!$C$4:$E$103,3,FALSE)=\"\",\"\",VLOOKUP($A20,フラッシュカードデータ!$C$4:$E$103,3,FALSE))","v":933}]
[11,{"$f":"IF(VLOOKUP($A22,フラッシュカードデータ!$C$4:$E$103,2,FALSE)=\"\",\"\",VLOOKUP($A22,フラッシュカードデータ!$C$4:$E$103,2,FALSE))","v":855}]
[null,{"$f":"IF(VLOOKUP($A22,フラッシュカードデータ!$C$4:$E$103,3,FALSE)=\"\",\"\",VLOOKUP($A22,フラッシュカードデータ!$C$4:$E$103,3,FALSE))","v":855}]
[12,{"$f":"IF(VLOOKUP($A24,フラッシュカードデータ!$C$4:$E$103,2,FALSE)=\"\",\"\",VLOOKUP($A24,フラッシュカードデータ!$C$4:$E$103,2,FALSE))","v":674}]
[null,{"$f":"IF(VLOOKUP($A24,フラッシュカードデータ!$C$4:$E$103,3,FALSE)=\"\",\"\",VLOOKUP($A24,フラッシュカードデータ!$C$4:$E$103,3,FALSE))","v":674}]
[13,{"$f":"IF(VLOOKUP($A26,フラッシュカードデータ!$C$4:$E$103,2,FALSE)=\"\",\"\",VLOOKUP($A26,フラッシュカードデータ!$C$4:$E$103,2,FALSE))","v":151}]
[null,{"$f":"IF(VLOOKUP($A26,フラッシュカードデータ!$C$4:$E$103,3,FALSE)=\"\",\"\",VLOOKUP($A26,フラッシュカードデータ!$C$4:$E$103,3,FALSE))","v":151}]
[14,{"$f":"IF(VLOOKUP($A28,フラッシュカードデータ!$C$4:$E$103,2,FALSE)=\"\",\"\",VLOOKUP($A28,フラッシュカードデータ!$C$4:$E$103,2,FALSE))","v":847}]
[null,{"$f":"IF(VLOOKUP($A28,フラッシュカードデータ!$C$4:$E$103,3,FALSE)=\"\",\"\",VLOOKUP($A28,フラッシュカードデータ!$C$4:$E$103,3,FALSE))","v":847}]
[15,{"$f":"IF(VLOOKUP($A30,フラッシュカードデータ!$C$4:$E$103,2,FALSE)=\"\",\"\",VLOOKUP($A30,フラッシュカードデータ!$C$4:$E$103,2,FALSE))","v":449}]
{"$rows_left_out":172}
{"sheet":"フラッシュカード(横長印刷用）","index":4,"n_rows":201,"n_cols":4,"rows_kept":201,"cut":false,"hidden":false,"merged":[[2,3,2,8],[1,3,1,8],[205,0,206,0],[207,0,208,0],[209,0,210,0],[193,0,194,0],[195,0,196,0],[197,0,198,0],[199,0,200,0],[201,0,202,0],[203,0,204,0],[169,0,170,0],[171,0,172,0],[173,0,174,0],[175,0,176,0],[177,0,178,0],[179,0,180,0],[181,0,182,0],[183,0,184,0],[185,0,186,0],[129,0,130,0],[187,0,188,0],[189,0,190,0],[191,0,192,0],[145,0,146,0],[147,0,148,0],[149,0,150,0],[151,0,152,0],[153,0,154,0],[155,0,156,0],[141,0,142,0],[159,0,160,0],[161,0,162,0],[163,0,164,0],[165,0,166,0],[167,0,168,0],[157,0,158,0],[113,0,114,0],[131,0,132,0],[133,0,134,0],[135,0,136,0],[137,0,138,0],[139,0,140,0],[121,0,122,0],[123,0,124,0],[125,0,126,0],[127,0,128,0],[85,0,86,0],[143,0,144,0],[97,0,98,0],[99,0,100,0],[101,0,102,0],[103,0,104,0],[105,0,106,0],[107,0,108,0],[109,0,110,0],[111,0,112,0],[69,0,70,0],[115,0,116,0],[117,0,118,0],[119,0,120,0],[73,0,74,0],[75,0,76,0],[77,0,78,0],[79,0,80,0],[81,0,82,0],[83,0,84,0],[35,0,36,0],[93,0,94,0],[95,0,96,0],[49,0,50,0],[51,0,52,0],[53,0,54,0],[55,0,56,0],[57,0,58,0],[65,0,66,0],[67,0,68,0],[11,0,12,0],[87,0,88,0],[89,0,90,0],[91,0,92,0],[71,0,72,0],[25,0,26,0],[27,0,28,0],[29,0,30,0],[31,0,32,0],[33,0,34,0],[43,0,44,0],[45,0,46,0],[59,0,60,0],[61,0,62,0],[63,0,64,0],[1,0,2,0],[3,0,4,0],[5,0,6,0],[7,0,8,0],[9,0,10,0],[47,0,48,0],[37,0,38,0],[39,0,40,0],[13,0,14,0],[15,0,16,0],[17,0,18,0],[41,0,42,0],[19,0,20,0],[21,0,22,0],[23,0,24,0]]}
[null,{"$f":"IF(フラッシュカードデータ!$C$2=\"\",\"\",フラッシュカードデータ!$C$2)","v":"数字でかきましょう"}]
[1,{"$f":"IF(VLOOKUP($A2,フラッシュカードデータ!$C$4:$E$103,2,FALSE)=\"\",\"\",VLOOKUP($A2,フラッシュカードデータ!$C$4:$E$103,2,FALSE))","v":920},null,"A4用紙（横向き)に\n印刷されます。"]
[null,{"$f":"IF(VLOOKUP($A2,フラッシュカードデータ!$C$4:$E$103,3,FALSE)=\"\",\"\",VLOOKUP($A2,フラッシュカードデータ!$C$4:$E$103,3,FALSE))","v":920},null,"真ん中で折って、\n貼り合わせると\nフラッシュカードが\nできあがります。"]
[2,{"$f":"IF(VLOOKUP($A4,フラッシュカードデータ!$C$4:$E$103,2,FALSE)=\"\",\"\",VLOOKUP($A4,フラッシュカードデータ!$C$4:$E$103,2,FALSE))","v":672}]
[null,{"$f":"IF(VLOOKUP($A4,フラッシュカードデータ!$C$4:$E$103,3,FALSE)=\"\",\"\",VLOOKUP($A4,フラッシュカードデータ!$C$4:$E$103,3,FALSE))","v":672}]
[3,{"$f":"IF(VLOOKUP($A6,フラッシュカードデータ!$C$4:$E$103,2,FALSE)=\"\",\"\",VLOOKUP($A6,フラッシュカードデータ!$C$4:$E$103,2,FALSE))","v":496}]
[null,{"$f":"IF(VLOOKUP($A6,フラッシュカードデータ!$C$4:$E$103,3,FALSE)=\"\",\"\",VLOOKUP($A6,フラッシュカードデータ!$C$4:$E$103,3,FALSE))","v":496}]
[4,{"$f":"IF(VLOOKUP($A8,フラッシュカードデータ!$C$4:$E$103,2,FALSE)=\"\",\"\",VLOOKUP($A8,フラッシュカードデータ!$C$4:$E$103,2,FALSE))","v":545}]
[null,{"$f":"IF(VLOOKUP($A8,フラッシュカードデータ!$C$4:$E$103,3,FALSE)=\"\",\"\",VLOOKUP($A8,フラッシュカードデータ!$C$4:$E$103,3,FALSE))","v":545}]
[5,{"$f":"IF(VLOOKUP($A10,フラッシュカードデータ!$C$4:$E$103,2,FALSE)=\"\",\"\",VLOOKUP($A10,フラッシュカードデータ!$C$4:$E$103,2,FALSE))","v":260}]
[null,{"$f":"IF(VLOOKUP($A10,フラッシュカードデータ!$C$4:$E$103,3,FALSE)=\"\",\"\",VLOOKUP($A10,フラッシュカードデータ!$C$4:$E$103,3,FALSE))","v":260}]
[6,{"$f":"IF(VLOOKUP($A12,フラッシュカードデータ!$C$4:$E$103,2,FALSE)=\"\",\"\",VLOOKUP($A12,フラッシュカードデータ!$C$4:$E$103,2,FALSE))","v":473}]
[null,{"$f":"IF(VLOOKUP($A12,フラッシュカードデータ!$C$4:$E$103,3,FALSE)=\"\",\"\",VLOOKUP($A12,フラッシュカードデータ!$C$4:$E$103,3,FALSE))","v":473}]
[7,{"$f":"IF(VLOOKUP($A14,フラッシュカードデータ!$C$4:$E$103,2,FALSE)=\"\",\"\",VLOOKUP($A14,フラッシュカードデータ!$C$4:$E$103,2,FALSE))","v":176}]
[null,{"$f":"IF(VLOOKUP($A14,フラッシュカードデータ!$C$4:$E$103,3,FALSE)=\"\",\"\",VLOOKUP($A14,フラッシュカードデータ!$C$4:$E$103,3,FALSE))","v":176}]
[8,{"$f":"IF(VLOOKUP($A16,フラッシュカードデータ!$C$4:$E$103,2,FALSE)=\"\",\"\",VLOOKUP($A16,フラッシュカードデータ!$C$4:$E$103,2,FALSE))","v":850}]
[null,{"$f":"IF(VLOOKUP($A16,フラッシュカードデータ!$C$4:$E$103,3,FALSE)=\"\",\"\",VLOOKUP($A16,フラッシュカードデータ!$C$4:$E$103,3,FALSE))","v":850}]
[9,{"$f":"IF(VLOOKUP($A18,フラッシュカードデータ!$C$4:$E$103,2,FALSE)=\"\",\"\",VLOOKUP($A18,フラッシュカードデータ!$C$4:$E$103,2,FALSE))","v":523}]
[null,{"$f":"IF(VLOOKUP($A18,フラッシュカードデータ!$C$4:$E$103,3,FALSE)=\"\",\"\",VLOOKUP($A18,フラッシュカードデータ!$C$4:$E$103,3,FALSE))","v":523}]
[10,{"$f":"IF(VLOOKUP($A20,フラッシュカードデータ!$C$4:$E$103,2,FALSE)=\"\",\"\",VLOOKUP($A20,フラッシュカードデータ!$C$4:$E$103,2,FALSE))","v":933}]
[null,{"$f":"IF(VLOOKUP($A20,フラッシュカードデータ!$C$4:$E$103,3,FALSE)=\"\",\"\",VLOOKUP($A20,フラッシュカードデータ!$C$4:$E$103,3,FALSE))","v":933}]
[11,{"$f":"IF(VLOOKUP($A22,フラッシュカードデータ!$C$4:$E$103,2,FALSE)=\"\",\"\",VLOOKUP($A22,フラッシュカードデータ!$C$4:$E$103,2,FALSE))","v":855}]
[null,{"$f":"IF(VLOOKUP($A22,フラッシュカードデータ!$C$4:$E$103,3,FALSE)=\"\",\"\",VLOOKUP($A22,フラッシュカードデータ!$C$4:$E$103,3,FALSE))","v":855}]
[12,{"$f":"IF(VLOOKUP($A24,フラッシュカードデータ!$C$4:$E$103,2,FALSE)=\"\",\"\",VLOOKUP($A24,フラッシュカードデータ!$C$4:$E$103,2,FALSE))","v":674}]
[null,{"$f":"IF(VLOOKUP($A24,フラッシュカードデータ!$C$4:$E$103,3,FALSE)=\"\",\"\",VLOOKUP($A24,フラッシュカードデータ!$C$4:$E$103,3,FALSE))","v":674}]
[13,{"$f":"IF(VLOOKUP($A26,フラッシュカードデータ!$C$4:$E$103,2,FALSE)=\"\",\"\",VLOOKUP($A26,フラッシュカードデータ!$C$4:$E$103,2,FALSE))","v":151}]
[null,{"$f":"IF(VLOOKUP($A26,フラッシュカードデータ!$C$4:$E$103,3,FALSE)=\"\",\"\",VLOOKUP($A26,フラッシュカードデータ!$C$4:$E$103,3,FALSE))","v":151}]
[14,{"$f":"IF(VLOOKUP($A28,フラッシュカードデータ!$C$4:$E$103,2,FALSE)=\"\",\"\",VLOOKUP($A28,フラッシュカードデータ!$C$4:$E$103,2,FALSE))","v":847}]
[null,{"$f":"IF(VLOOKUP($A28,フラッシュカードデータ!$C$4:$E$103,3,FALSE)=\"\",\"\",VLOOKUP($A28,フラッシュカードデータ!$C$4:$E$103,3,FALSE))","v":847}]
[15,{"$f":"IF(VLOOKUP($A30,フラッシュカードデータ!$C$4:$E$103,2,FALSE)=\"\",\"\",VLOOKUP($A30,フラッシュカードデータ!$C$4:$E$103,2,FALSE))","v":449}]
{"$rows_left_out":172}
{"sheet":"フラッシュカード(横短印刷用）","index":5,"n_rows":201,"n_cols":4,"rows_kept":201,"cut":false,"hidden":false,"merged":[[201,0,202,0],[203,0,204,0],[205,0,206,0],[207,0,208,0],[209,0,210,0],[189,0,190,0],[191,0,192,0],[193,0,194,0],[195,0,196,0],[197,0,198,0],[199,0,200,0],[177,0,178,0],[179,0,180,0],[181,0,182,0],[183,0,184,0],[185,0,186,0],[187,0,188,0],[165,0,166,0],[167,0,168,0],[169,0,170,0],[171,0,172,0],[173,0,174,0],[175,0,176,0],[153,0,154,0],[155,0,156,0],[157,0,158,0],[159,0,160,0],[161,0,162,0],[163,0,164,0],[141,0,142,0],[143,0,144,0],[145,0,146,0],[147,0,148,0],[149,0,150,0],[151,0,152,0],[129,0,130,0],[131,0,132,0],[133,0,134,0],[135,0,136,0],[137,0,138,0],[139,0,140,0],[117,0,118,0],[119,0,120,0],[121,0,122,0],[123,0,124,0],[125,0,126,0],[127,0,128,0],[105,0,106,0],[107,0,108,0],[109,0,110,0],[111,0,112,0],[113,0,114,0],[115,0,116,0],[93,0,94,0],[95,0,96,0],[97,0,98,0],[99,0,100,0],[101,0,102,0],[103,0,104,0],[81,0,82,0],[83,0,84,0],[85,0,86,0],[87,0,88,0],[89,0,90,0],[91,0,92,0],[69,0,70,0],[71,0,72,0],[73,0,74,0],[75,0,76,0],[77,0,78,0],[79,0,80,0],[57,0,58,0],[59,0,60,0],[61,0,62,0],[63,0,64,0],[65,0,66,0],[67,0,68,0],[45,0,46,0],[47,0,48,0],[49,0,50,0],[51,0,52,0],[53,0,54,0],[55,0,56,0],[33,0,34,0],[35,0,36,0],[37,0,38,0],[39,0,40,0],[41,0,42,0],[43,0,44,0],[21,0,22,0],[23,0,24,0],[25,0,26,0],[27,0,28,0],[29,0,30,0],[31,0,32,0],[9,0,10,0],[11,0,12,0],[13,0,14,0],[15,0,16,0],[17,0,18,0],[19,0,20,0],[1,0,2,0],[1,3,1,8],[2,3,2,8],[3,0,4,0],[5,0,6,0],[7,0,8,0]]}
[null,{"$f":"IF(フラッシュカードデータ!$C$2=\"\",\"\",フラッシュカードデータ!$C$2)","v":"数字でかきましょう"}]
[1,{"$f":"IF(VLOOKUP($A2,フラッシュカードデータ!$C$4:$E$103,2,FALSE)=\"\",\"\",VLOOKUP($A2,フラッシュカードデータ!$C$4:$E$103,2,FALSE))","v":920},null,"A4用紙（縦向き)に\n印刷されます。"]
[null,{"$f":"IF(VLOOKUP($A2,フラッシュカードデータ!$C$4:$E$103,3,FALSE)=\"\",\"\",VLOOKUP($A2,フラッシュカードデータ!$C$4:$E$103,3,FALSE))","v":920},null,"真ん中で折って、\n貼り合わせると\nフラッシュカードが\nできあがります。"]
[2,{"$f":"IF(VLOOKUP($A4,フラッシュカードデータ!$C$4:$E$103,2,FALSE)=\"\",\"\",VLOOKUP($A4,フラッシュカードデータ!$C$4:$E$103,2,FALSE))","v":672}]
[null,{"$f":"IF(VLOOKUP($A4,フラッシュカードデータ!$C$4:$E$103,3,FALSE)=\"\",\"\",VLOOKUP($A4,フラッシュカードデータ!$C$4:$E$103,3,FALSE))","v":672}]
[3,{"$f":"IF(VLOOKUP($A6,フラッシュカードデータ!$C$4:$E$103,2,FALSE)=\"\",\"\",VLOOKUP($A6,フラッシュカードデータ!$C$4:$E$103,2,FALSE))","v":496}]
[null,{"$f":"IF(VLOOKUP($A6,フラッシュカードデータ!$C$4:$E$103,3,FALSE)=\"\",\"\",VLOOKUP($A6,フラッシュカードデータ!$C$4:$E$103,3,FALSE))","v":496}]
[4,{"$f":"IF(VLOOKUP($A8,フラッシュカードデータ!$C$4:$E$103,2,FALSE)=\"\",\"\",VLOOKUP($A8,フラッシュカードデータ!$C$4:$E$103,2,FALSE))","v":545}]
[null,{"$f":"IF(VLOOKUP($A8,フラッシュカードデータ!$C$4:$E$103,3,FALSE)=\"\",\"\",VLOOKUP($A8,フラッシュカードデータ!$C$4:$E$103,3,FALSE))","v":545}]
[5,{"$f":"IF(VLOOKUP($A10,フラッシュカードデータ!$C$4:$E$103,2,FALSE)=\"\",\"\",VLOOKUP($A10,フラッシュカードデータ!$C$4:$E$103,2,FALSE))","v":260}]
[null,{"$f":"IF(VLOOKUP($A10,フラッシュカードデータ!$C$4:$E$103,3,FALSE)=\"\",\"\",VLOOKUP($A10,フラッシュカードデータ!$C$4:$E$103,3,FALSE))","v":260}]
[6,{"$f":"IF(VLOOKUP($A12,フラッシュカードデータ!$C$4:$E$103,2,FALSE)=\"\",\"\",VLOOKUP($A12,フラッシュカードデータ!$C$4:$E$103,2,FALSE))","v":473}]
[null,{"$f":"IF(VLOOKUP($A12,フラッシュカードデータ!$C$4:$E$103,3,FALSE)=\"\",\"\",VLOOKUP($A12,フラッシュカードデータ!$C$4:$E$103,3,FALSE))","v":473}]
[7,{"$f":"IF(VLOOKUP($A14,フラッシュカードデータ!$C$4:$E$103,2,FALSE)=\"\",\"\",VLOOKUP($A14,フラッシュカードデータ!$C$4:$E$103,2,FALSE))","v":176}]
[null,{"$f":"IF(VLOOKUP($A14,フラッシュカードデータ!$C$4:$E$103,3,FALSE)=\"\",\"\",VLOOKUP($A14,フラッシュカードデータ!$C$4:$E$103,3,FALSE))","v":176}]
[8,{"$f":"IF(VLOOKUP($A16,フラッシュカードデータ!$C$4:$E$103,2,FALSE)=\"\",\"\",VLOOKUP($A16,フラッシュカードデータ!$C$4:$E$103,2,FALSE))","v":850}]
[null,{"$f":"IF(VLOOKUP($A16,フラッシュカードデータ!$C$4:$E$103,3,FALSE)=\"\",\"\",VLOOKUP($A16,フラッシュカードデータ!$C$4:$E$103,3,FALSE))","v":850}]
[9,{"$f":"IF(VLOOKUP($A18,フラッシュカードデータ!$C$4:$E$103,2,FALSE)=\"\",\"\",VLOOKUP($A18,フラッシュカードデータ!$C$4:$E$103,2,FALSE))","v":523}]
[null,{"$f":"IF(VLOOKUP($A18,フラッシュカードデータ!$C$4:$E$103,3,FALSE)=\"\",\"\",VLOOKUP($A18,フラッシュカードデータ!$C$4:$E$103,3,FALSE))","v":523}]
[10,{"$f":"IF(VLOOKUP($A20,フラッシュカードデータ!$C$4:$E$103,2,FALSE)=\"\",\"\",VLOOKUP($A20,フラッシュカードデータ!$C$4:$E$103,2,FALSE))","v":933}]
[null,{"$f":"IF(VLOOKUP($A20,フラッシュカードデータ!$C$4:$E$103,3,FALSE)=\"\",\"\",VLOOKUP($A20,フラッシュカードデータ!$C$4:$E$103,3,FALSE))","v":933}]
[11,{"$f":"IF(VLOOKUP($A22,フラッシュカードデータ!$C$4:$E$103,2,FALSE)=\"\",\"\",VLOOKUP($A22,フラッシュカードデータ!$C$4:$E$103,2,FALSE))","v":855}]
[null,{"$f":"IF(VLOOKUP($A22,フラッシュカードデータ!$C$4:$E$103,3,FALSE)=\"\",\"\",VLOOKUP($A22,フラッシュカードデータ!$C$4:$E$103,3,FALSE))","v":855}]
[12,{"$f":"IF(VLOOKUP($A24,フラッシュカードデータ!$C$4:$E$103,2,FALSE)=\"\",\"\",VLOOKUP($A24,フラッシュカードデータ!$C$4:$E$103,2,FALSE))","v":674}]
[null,{"$f":"IF(VLOOKUP($A24,フラッシュカードデータ!$C$4:$E$103,3,FALSE)=\"\",\"\",VLOOKUP($A24,フラッシュカードデータ!$C$4:$E$103,3,FALSE))","v":674}]
[13,{"$f":"IF(VLOOKUP($A26,フラッシュカードデータ!$C$4:$E$103,2,FALSE)=\"\",\"\",VLOOKUP($A26,フラッシュカードデータ!$C$4:$E$103,2,FALSE))","v":151}]
[null,{"$f":"IF(VLOOKUP($A26,フラッシュカードデータ!$C$4:$E$103,3,FALSE)=\"\",\"\",VLOOKUP($A26,フラッシュカードデータ!$C$4:$E$103,3,FALSE))","v":151}]
[14,{"$f":"IF(VLOOKUP($A28,フラッシュカードデータ!$C$4:$E$103,2,FALSE)=\"\",\"\",VLOOKUP($A28,フラッシュカードデータ!$C$4:$E$103,2,FALSE))","v":847}]
[null,{"$f":"IF(VLOOKUP($A28,フラッシュカードデータ!$C$4:$E$103,3,FALSE)=\"\",\"\",VLOOKUP($A28,フラッシュカードデータ!$C$4:$E$103,3,FALSE))","v":847}]
[15,{"$f":"IF(VLOOKUP($A30,フラッシュカードデータ!$C$4:$E$103,2,FALSE)=\"\",\"\",VLOOKUP($A30,フラッシュカードデータ!$C$4:$E$103,2,FALSE))","v":449}]
{"$rows_left_out":171}